BDBM50249928 (8S,9S,12S,13R,14S,16R)-13-(2,2-difluoroethylamino)-19-(2-(dimethylamino)ethylamino)-8,14-dimethoxy-4,10,12,16-tetramethyl-3,20,22-trioxo-2-azabicyclo[16.3.1]docosa-1(21),4,6,10,18-pentaen-9-yl carbamate::CHEMBL503969
SMILES CO[C@H]1C[C@H](C)Cc2c(O)c(NC(=O)C(C)=CC=C[C@H](OC)[C@@H](OC(N)=O)\C(C)=C\[C@H](C)[C@H]1NCC(F)F)cc(O)c2N=CCN(C)C
InChI Key InChIKey=FIJNKDDGKLZXKM-JDVSYQTASA-N
Data  1 Kd
  Tab Delimited (TSV)   2D SDfile   Computed 3D by Vconf -m prep SDfile
Find this compound or compounds like it in BindingDB:
Activity Spreadsheet -- Enzyme Inhibition Constant Data from BindingDB
Found 1 hit for monomerid = 50249928
TargetHeat shock protein HSP 90-beta(Homo sapiens (Human))
Kosan Biosciences
Curated by ChEMBL
LigandPNGBDBM50249928((8S,9S,12S,13R,14S,16R)-13-(2,2-difluoroethylamino...)
Affinity DataKd:  2.90E+3nM. Assay description: Binding affinity to human recombinant HSP90
In DepthDetails ArticlePubMed