BDBM50249977 CHEMBL1234304
SMILES Nc1nc2n(c[n+](Cc3ccccc3)c2c(=O)[nH]1)[C@@H]1O[C@H](COP(O)(O)=O)[C@@H](O)[C@H]1O
InChI Key InChIKey=WMKJRKYLDWLLPS-XNIJJKJLSA-O
Data  1 Kd
PDB links: 1 PDB ID matches this monomer.
  Tab Delimited (TSV)   2D SDfile   Computed 3D by Vconf -m prep SDfile
Find this compound or compounds like it in BindingDB:
Activity Spreadsheet -- Enzyme Inhibition Constant Data from BindingDB
Found 1 hit for monomerid = 50249977
TargetEukaryotic translation initiation factor 4E(Homo sapiens (Human))
Mayo Clinic
Curated by ChEMBL
LigandPNGBDBM50249977(CHEMBL1234304)
Affinity DataKd:  800nM. Assay description: Binding affinity to eIF4E (unknown origin) by fluorescence titration assay