BDBM50250727 (2R,5R,10S,13R,14R,17R)-17-((2R)-5,6-dihydroxy-6-methylheptan-2-yl)-2-hydroxy-4,4,10,13,14-pentamethyl-4,5,6,7,10,11,12,13,14,15,16,17-dodecahydro-1H-cyclopenta[a]phenanthren-3(2H)-one::2-alpha,24,25-trihydroxylanostan-3-one::CHEMBL513686
SMILES C[C@H](CCC(O)C(C)(C)O)[C@H]1CC[C@@]2(C)C3=C(CC[C@]12C)[C@@]1(C)C[C@@H](O)C(=O)C(C)(C)[C@@H]1CC3
InChI Key InChIKey=TZXHHXSEUPQHDR-ITLZUSRVSA-N
Data  1 IC50
  Tab Delimited (TSV)   2D SDfile   Computed 3D by Vconf -m prep SDfile
Find this compound or compounds like it in BindingDB:
Activity Spreadsheet -- Enzyme Inhibition Constant Data from BindingDB
Found 1 hit for monomerid = 50250727
TargetType II restriction enzyme EcoRI(Escherichia coli)
Merck Research Laboratories
Curated by ChEMBL
LigandPNGBDBM50250727((2R,5R,10S,13R,14R,17R)-17-((2R)-5,6-dihydroxy-6-m...)
Affinity DataIC50: >5.00E+4nM. Assay description: Inhibition of Escherichia coli ECOR1
In DepthDetails ArticlePubMed