BDBM50251050 CHEMBL516149::N-(1-benzyl-1H-benzo[d]imidazol-5-yl)(2-chlorophenyl)methanesulfonamide
SMILES Clc1ccccc1CS(=O)(=O)Nc1ccc2n(Cc3ccccc3)cnc2c1
InChI Key InChIKey=HKRXVIMQFWPWEO-UHFFFAOYSA-N
Data  1 EC50
  Tab Delimited (TSV)   2D SDfile   Computed 3D by Vconf -m prep SDfile
Find this compound or compounds like it in BindingDB:
Activity Spreadsheet -- Enzyme Inhibition Constant Data from BindingDB
Found 1 hit for monomerid = 50251050
TargetNuclear receptor subfamily 1 group I member 2(Homo sapiens (Human))
University Of Montpellier
Curated by ChEMBL
LigandPNGBDBM50251050(CHEMBL516149 | N-(1-benzyl-1H-benzo[d]imidazol-5-y...)
Affinity DataEC50:  176nM. Assay description: Agonist activity at human pregnane X receptor expressed in HGPXR reporter cells
In DepthDetails ArticlePubMed