BDBM50251108 CHEMBL4069022
SMILES C[C@@H]1CNCCN1C(=O)c1nc(Nc2cc(C)[nH]n2)c2cc(Cl)ccc2n1
InChI Key InChIKey=REYHGZRMWPEZMQ-LLVKDONJSA-N
Data  2 KI
  Tab Delimited (TSV)   2D SDfile   Computed 3D by Vconf -m prep SDfile
Find this compound or compounds like it in BindingDB:
Activity Spreadsheet -- Enzyme Inhibition Constant Data from BindingDB
Found 2 hits for monomerid = 50251108
TargetSerine/threonine-protein kinase PAK 4(Homo sapiens (Human))
Shenyang Pharmaceutical University
Curated by ChEMBL
LigandPNGBDBM50251108(CHEMBL4069022)
Affinity DataKi:  151nM. Assay description: Inhibition of human PAK4 kinase domain using coumarin and fluorescein-labeled ser/thr20 peptide as substrate preincubated for 15 mins followed by ATP...
In DepthDetails ArticlePubMed
TargetSerine/threonine-protein kinase PAK 1(Homo sapiens (Human))
Shenyang Pharmaceutical University
Curated by ChEMBL
LigandPNGBDBM50251108(CHEMBL4069022)
Affinity DataKi: >4.52E+3nM. Assay description: Inhibition of human PAK1 kinase domain using coumarin and fluorescein-labeled ser/thr19 peptide as substrate preincubated for 15 mins followed by ATP...
In DepthDetails ArticlePubMed