BDBM50251145 CHEMBL4071328
SMILES NC1CCN(CC1)c1nc(Nc2cn(cn2)-c2ccccc2)c2cc(Cl)ccc2n1
InChI Key InChIKey=LZUXFPHHPPFWHN-UHFFFAOYSA-N
Data  1 KI
  Tab Delimited (TSV)   2D SDfile   Computed 3D by Vconf -m prep SDfile
Find this compound or compounds like it in BindingDB:
Activity Spreadsheet -- Enzyme Inhibition Constant Data from BindingDB
Found 1 hit for monomerid = 50251145
TargetSerine/threonine-protein kinase PAK 4(Homo sapiens (Human))
Shenyang Pharmaceutical University
Curated by ChEMBL
LigandPNGBDBM50251145(CHEMBL4071328)
Affinity DataKi:  1.44E+3nM. Assay description: Inhibition of human PAK4 kinase domain using coumarin and fluorescein-labeled ser/thr20 peptide as substrate preincubated for 15 mins followed by ATP...
In DepthDetails ArticlePubMed