BDBM50251182 CHEMBL4069074
SMILES Cc1cc(Nc2nc(nc3ccc(Cl)cc23)C(=O)N2CCC(N)CC2)n[nH]1
InChI Key InChIKey=UTFKJYFRHSSYPD-UHFFFAOYSA-N
Data  1 KI
  Tab Delimited (TSV)   2D SDfile   Computed 3D by Vconf -m prep SDfile
Find this compound or compounds like it in BindingDB:
Activity Spreadsheet -- Enzyme Inhibition Constant Data from BindingDB
Found 1 hit for monomerid = 50251182
TargetSerine/threonine-protein kinase PAK 4(Homo sapiens (Human))
Shenyang Pharmaceutical University
Curated by ChEMBL
LigandPNGBDBM50251182(CHEMBL4069074)
Affinity DataKi:  354nM. Assay description: Inhibition of human PAK4 kinase domain using coumarin and fluorescein-labeled ser/thr20 peptide as substrate preincubated for 15 mins followed by ATP...
In DepthDetails ArticlePubMed