BDBM50251216 CHEMBL4097493
SMILES CCCOC(=O)[C@]1(C[C@H]1CN1CCC(O)(CC1)c1ccc(Cl)cc1)c1ccccc1
InChI Key InChIKey=VFHCSNDHEQBRLY-SQJMNOBHSA-N
Data  1 KI
  Tab Delimited (TSV)   2D SDfile   Computed 3D by Vconf -m prep SDfile
Find this compound or compounds like it in BindingDB:
Activity Spreadsheet -- Enzyme Inhibition Constant Data from BindingDB
Found 1 hit for monomerid = 50251216
TargetSigma non-opioid intracellular receptor 1(Cavia porcellus (Guinea pig))
Universit£
Curated by ChEMBL
LigandPNGBDBM50251216(CHEMBL4097493)
Affinity DataKi:  33nM. Assay description: Displacement of [3H]-(+)-pentazocine from sigma1 receptor in guinea pig brain membrane after 150 mins by liquid scintillation counting method
In DepthDetails ArticlePubMed