BDBM50251414 (2S,4S)-1-(2-((1S,5R,6s)-3-(5-chloropyridin-2-yl)-3-aza-bicyclo[3.1.0]hexan-6-ylamino)acetyl)-4-fluoropyrrolidine-2-carbonitrile::CHEMBL471956
SMILES F[C@H]1C[C@@H](C#N)N(C1)C(=O)CN[C@@H]1[C@H]2CN(C[C@@H]12)c1ccc(Cl)cn1
InChI Key InChIKey=UGAJFBJKPIYEMY-CKENWRIRSA-N
Data  4 IC50
  Tab Delimited (TSV)   2D SDfile   Computed 3D by Vconf -m prep SDfile
Find this compound or compounds like it in BindingDB:
Activity Spreadsheet -- Enzyme Inhibition Constant Data from BindingDB
Found 4 hits for monomerid = 50251414
TargetDipeptidyl peptidase 4(Homo sapiens (Human))
Ranbaxy Research Laboratories
Curated by ChEMBL
LigandPNGBDBM50251414((2S,4S)-1-(2-((1S,5R,6s)-3-(5-chloropyridin-2-yl)-...)
Affinity DataIC50:  49nM. Assay description: Inhibition of human plasma DPP4
In DepthDetails ArticlePubMed
TargetProlyl endopeptidase(Homo sapiens (Human))
Ranbaxy Research Laboratories
Curated by ChEMBL
LigandPNGBDBM50251414((2S,4S)-1-(2-((1S,5R,6s)-3-(5-chloropyridin-2-yl)-...)
Affinity DataIC50:  9.04E+3nM. Assay description: Inhibition of PPCE (unknown origin)
In DepthDetails ArticlePubMed
TargetDipeptidyl peptidase 8(Homo sapiens (Human))
Ranbaxy Research Laboratories
Curated by ChEMBL
LigandPNGBDBM50251414((2S,4S)-1-(2-((1S,5R,6s)-3-(5-chloropyridin-2-yl)-...)
Affinity DataIC50:  2.38E+3nM. Assay description: Inhibition of DPP8 (unknown origin)
In DepthDetails ArticlePubMed
TargetDipeptidyl peptidase 2(Homo sapiens (Human))
Ranbaxy Research Laboratories
Curated by ChEMBL
LigandPNGBDBM50251414((2S,4S)-1-(2-((1S,5R,6s)-3-(5-chloropyridin-2-yl)-...)
Affinity DataIC50:  8.75E+3nM. Assay description: Inhibition of DPP2 (unknown origin)
In DepthDetails ArticlePubMed