BDBM50252036 CHEMBL481169::N-(4-((2-cyano-7-(2-cyclohexylethyl)-7H-pyrrolo[2,3-d]pyrimidin-6-yl)methoxy)phenyl)propionamide
SMILES CCC(=O)Nc1ccc(OCc2cc3cnc(nc3n2CCC2CCCCC2)C#N)cc1
InChI Key InChIKey=XJSLJCYHZHBCHU-UHFFFAOYSA-N
Data  3 IC50
  Tab Delimited (TSV)   2D SDfile   Computed 3D by Vconf -m prep SDfile
Find this compound or compounds like it in BindingDB:
Activity Spreadsheet -- Enzyme Inhibition Constant Data from BindingDB
Found 3 hits for monomerid = 50252036
TargetCathepsin S(Homo sapiens (Human))
Novartis Institutes For Biomedical Research
Curated by ChEMBL
LigandPNGBDBM50252036(CHEMBL481169 | N-(4-((2-cyano-7-(2-cyclohexylethyl...)
Affinity DataIC50:  12nM. Assay description: Inhibition of human recombinant cathepsin S by fluorescence assay
In DepthDetails ArticlePubMed
TargetProcathepsin L(Homo sapiens (Human))
Novartis Institutes For Biomedical Research
Curated by ChEMBL
LigandPNGBDBM50252036(CHEMBL481169 | N-(4-((2-cyano-7-(2-cyclohexylethyl...)
Affinity DataIC50: >4.00E+3nM. Assay description: Inhibition of human recombinant cathepsin L by fluorescence assay
In DepthDetails ArticlePubMed
TargetCathepsin K(Homo sapiens (Human))
Novartis Institutes For Biomedical Research
Curated by ChEMBL
LigandPNGBDBM50252036(CHEMBL481169 | N-(4-((2-cyano-7-(2-cyclohexylethyl...)
Affinity DataIC50: >1.50E+3nM. Assay description: Inhibition of human recombinant cathepsin K by fluorescence assay
In DepthDetails ArticlePubMed