BDBM50252068 4-[(2,4-Difluorobenzyl)thio]-7-(beta-D-ribofuranosyl)-7H-pyrrolo[2,3-d]pyrimidine::CHEMBL480971
SMILES OC[C@H]1O[C@H]([C@H](O)[C@@H]1O)n1ccc2c(SCc3ccc(F)cc3F)ncnc12
InChI Key InChIKey=NWJWEMQOGKJJLB-ATNYBXOESA-N
Data  1 KI
  Tab Delimited (TSV)   2D SDfile   Computed 3D by Vconf -m prep SDfile
Find this compound or compounds like it in BindingDB:
Activity Spreadsheet -- Enzyme Inhibition Constant Data from BindingDB
Found 1 hit for monomerid = 50252068
TargetAdenosine kinase(Toxoplasma gondii)
University Of Georgia
Curated by ChEMBL
LigandPNGBDBM50252068(4-[(2,4-Difluorobenzyl)thio]-7-(beta-D-ribofuranos...)
Affinity DataKi:  1.60E+4nM. Assay description: Binding affinity to purified Toxoplasma gondii adenosine kinase
In DepthDetails ArticlePubMed