BDBM50252241 (S)-N-(1-(4-(piperidin-4-yloxy)phenethyl)pyrrolidin-3-yl)-3,4-dichlorobenzamide::CHEMBL480165
SMILES Clc1ccc(cc1Cl)C(=O)N[C@H]1CCN(CCc2ccc(OC3CCNCC3)cc2)C1
InChI Key InChIKey=DPNJNFFAQJQRRQ-IBGZPJMESA-N
Data  1 KI
  Tab Delimited (TSV)   2D SDfile   Computed 3D by Vconf -m prep SDfile
Find this compound or compounds like it in BindingDB:
Activity Spreadsheet -- Enzyme Inhibition Constant Data from BindingDB
Found 1 hit for monomerid = 50252241
TargetUrotensin-2 receptor(Homo sapiens (Human))
Glaxosmithkline
Curated by ChEMBL
LigandPNGBDBM50252241((S)-N-(1-(4-(piperidin-4-yloxy)phenethyl)pyrrolidi...)
Affinity DataKi:  42nM. Assay description: Antagonist activity at human recombinant urotensin 2 receptor expressed in HEK293 cells assessed as inhibition of urotensin 2-induced calcium mobiliz...
In DepthDetails ArticlePubMed