BDBM50252296 (S)-4-(2-(3-chlorophenyl)-2-hydroxyethylamino)-3-(4-methyl-6-(4-(4-methylpiperazin-1-yl)piperidin-1-yl)-1H-benzo[d]imidazol-2-yl)pyridin-2(1H)-one::CHEMBL451331
SMILES CN1CCN(CC1)C1CCN(CC1)c1cc(C)c2nc([nH]c2c1)-c1c(NC[C@@H](O)c2cccc(Cl)c2)cc[nH]c1=O
InChI Key InChIKey=ZJATUHGFXPEBQJ-HHHXNRCGSA-N
Data  3 IC50
  Tab Delimited (TSV)   2D SDfile   Computed 3D by Vconf -m prep SDfile
Find this compound or compounds like it in BindingDB:
Activity Spreadsheet -- Enzyme Inhibition Constant Data from BindingDB
Found 3 hits for monomerid = 50252296
TargetInsulin-like growth factor 1 receptor(Homo sapiens (Human))
Bristol-Myers Squibb
Curated by ChEMBL
LigandPNGBDBM50252296((S)-4-(2-(3-chlorophenyl)-2-hydroxyethylamino)-3-(...)
Affinity DataIC50:  28nM. Assay description: Inhibition of IGF1R (unknown origin)
In DepthDetails ArticlePubMed
TargetCytochrome P450 3A4(Homo sapiens (Human))
Bristol-Myers Squibb
Curated by ChEMBL
LigandPNGBDBM50252296((S)-4-(2-(3-chlorophenyl)-2-hydroxyethylamino)-3-(...)
Affinity DataIC50:  2.40nM. Assay description: Inhibition of CYP3A4 (unknown origin)
In DepthDetails ArticlePubMed
TargetInsulin-like growth factor 1 receptor(Mus musculus)
Bristol-Myers Squibb
Curated by ChEMBL
LigandPNGBDBM50252296((S)-4-(2-(3-chlorophenyl)-2-hydroxyethylamino)-3-(...)
Affinity DataIC50:  88nM. Assay description: Inhibition of IGF1R in mouse SAL cells assessed as thymidine incorporation
In DepthDetails ArticlePubMed