BDBM50252375 CHEMBL446072::Spheciosterol sulfate C
SMILES C[C@H](CCC(C)C(C)(C)C(C)=C)[C@H]1CC[C@@]2(C)[C@@H]3C[C@H](OS([O-])(=O)=O)[C@H]4[C@@H](O)[C@H](OS([O-])(=O)=O)[C@H](C[C@]4(C)C3=CC[C@]12C)OS([O-])(=O)=O
InChI Key InChIKey=DETNYAODLCRBJF-PJLURTLWSA-K
Data  1 IC50  1 EC50
  Tab Delimited (TSV)   2D SDfile   Computed 3D by Vconf -m prep SDfile
Find this compound or compounds like it in BindingDB:
Activity Spreadsheet -- Enzyme Inhibition Constant Data from BindingDB
Found 2 hits for monomerid = 50252375
TargetTranscription factor p65(Homo sapiens (Human))
University Of Utah
Curated by ChEMBL
LigandPNGBDBM50252375(CHEMBL446072 | Spheciosterol sulfate C)
Affinity DataEC50:  1.20E+4nM. Assay description: Inhibition of IL1-induced NFkappaB P65 activation in human osteoarthritic primary chondrocytes preincubated 2 hrs before addition of IL1 by ELISA
In DepthDetails ArticlePubMed
TargetProtein kinase C zeta type(Homo sapiens (Human))
University Of Utah
Curated by ChEMBL
LigandPNGBDBM50252375(CHEMBL446072 | Spheciosterol sulfate C)
Affinity DataIC50:  110nM. Assay description: Inhibition of PKCzeta (unknown origin) by TR-FRET based lanthascreen assay
In DepthDetails ArticlePubMed