BDBM50252525 CHEMBL493039::benzyl 1-(2-cyanopiperazin-1-yl)-3-methyl-1-oxobutan-2-ylcarbamate
SMILES CC(C)C(NC(=O)OCc1ccccc1)C(=O)N1CCCCN1C#N
InChI Key InChIKey=OCAFABUKPVDIBK-UHFFFAOYSA-N
Data  3 IC50
  Tab Delimited (TSV)   2D SDfile   Computed 3D by Vconf -m prep SDfile
Find this compound or compounds like it in BindingDB:
Activity Spreadsheet -- Enzyme Inhibition Constant Data from BindingDB
Found 3 hits for monomerid = 50252525
TargetCathepsin K(Homo sapiens (Human))
Korea Research Institute Of Chemical Technology
Curated by ChEMBL
LigandPNGBDBM50252525(CHEMBL493039 | benzyl 1-(2-cyanopiperazin-1-yl)-3-...)
Affinity DataIC50:  1nM. Assay description: Inhibition of human recombinant cathepsin K
In DepthDetails ArticlePubMed
TargetCathepsin B(Homo sapiens (Human))
Korea Research Institute Of Chemical Technology
Curated by ChEMBL
LigandPNGBDBM50252525(CHEMBL493039 | benzyl 1-(2-cyanopiperazin-1-yl)-3-...)
Affinity DataIC50:  11nM. Assay description: Inhibition of human recombinant cathepsin B
In DepthDetails ArticlePubMed
TargetProcathepsin L(Homo sapiens (Human))
Korea Research Institute Of Chemical Technology
Curated by ChEMBL
LigandPNGBDBM50252525(CHEMBL493039 | benzyl 1-(2-cyanopiperazin-1-yl)-3-...)
Affinity DataIC50:  145nM. Assay description: Inhibition of human recombinant cathepsin L
In DepthDetails ArticlePubMed