BDBM50252528 (2-(3,4-dichlorobenzyl)phenyl)-N,N-dimethylmethanamine::CHEMBL491268
SMILES CN(C)Cc1ccccc1Cc1ccc(Cl)c(Cl)c1
InChI Key InChIKey=RVVDMQMBQDIWKD-UHFFFAOYSA-N
Data  3 IC50
  Tab Delimited (TSV)   2D SDfile   Computed 3D by Vconf -m prep SDfile
Find this compound or compounds like it in BindingDB:
Activity Spreadsheet -- Enzyme Inhibition Constant Data from BindingDB
Found 3 hits for monomerid = 50252528
TargetSodium-dependent dopamine transporter(Homo sapiens (Human))
Pfizer
Curated by ChEMBL
LigandPNGBDBM50252528((2-(3,4-dichlorobenzyl)phenyl)-N,N-dimethylmethana...)
Affinity DataIC50:  320nM. Assay description: Inhibition of [3H]DA reuptake at human dopamine transporter expressed in HEK293 cells
In DepthDetails ArticlePubMed
TargetSodium-dependent serotonin transporter(Homo sapiens (Human))
Pfizer
Curated by ChEMBL
LigandPNGBDBM50252528((2-(3,4-dichlorobenzyl)phenyl)-N,N-dimethylmethana...)
Affinity DataIC50:  5nM. Assay description: Inhibition of [3H]5HT reuptake at human serotonin transporter expressed in HEK293 cells
In DepthDetails ArticlePubMed
TargetSodium-dependent noradrenaline transporter(Homo sapiens (Human))
Pfizer
Curated by ChEMBL
LigandPNGBDBM50252528((2-(3,4-dichlorobenzyl)phenyl)-N,N-dimethylmethana...)
Affinity DataIC50:  1.30E+3nM. Assay description: Inhibition of [3H]NA reuptake in human noradrenaline transporter expressed in HEK293 cells
In DepthDetails ArticlePubMed