BDBM50252651 3-((4-(2-aminopyrimidin-4-yl)-5-(4-fluorophenyl)-1H-imidazol-1-yl)methyl)benzamide::CHEMBL492858
SMILES NC(=O)c1cccc(Cn2cnc(c2-c2ccc(F)cc2)-c2ccnc(N)n2)c1
InChI Key InChIKey=YEACRCHNIHTVAC-UHFFFAOYSA-N
Data  2 IC50
  Tab Delimited (TSV)   2D SDfile   Computed 3D by Vconf -m prep SDfile
Find this compound or compounds like it in BindingDB:
Activity Spreadsheet -- Enzyme Inhibition Constant Data from BindingDB
Found 2 hits for monomerid = 50252651
TargetMitogen-activated protein kinase 14(Homo sapiens (Human))
Ewha Womans University
Curated by ChEMBL
LigandPNGBDBM50252651(3-((4-(2-aminopyrimidin-4-yl)-5-(4-fluorophenyl)-1...)
Affinity DataIC50: >1.00E+3nM. Assay description: Inhibition of GST fused human recombinant ALK5 expressed in Sf9 cells by radioisotopic protein kinase assay
In DepthDetails ArticlePubMed
TargetMitogen-activated protein kinase 14(Homo sapiens (Human))
Ewha Womans University
Curated by ChEMBL
LigandPNGBDBM50252651(3-((4-(2-aminopyrimidin-4-yl)-5-(4-fluorophenyl)-1...)
Affinity DataIC50: >1.00E+3nM. Assay description: Inhibition of human recombinant p38alpha MAPK expressed in Escherichia coli by radioisotopic protein kinase assay
In DepthDetails ArticlePubMed