BDBM50252692 CHEMBL494661::N-(4-Methanesulfonyloxyphenylmethyl)-4-[2-(1-methylethyl)phenyl]-1-piperazinehexanamide
SMILES CC(C)c1ccccc1N1CCN(CCCCCC(=O)NCc2ccc(OS(C)(=O)=O)cc2)CC1
InChI Key InChIKey=JVGOJMPFDKELFD-UHFFFAOYSA-N
Data  3 KI
  Tab Delimited (TSV)   2D SDfile   Computed 3D by Vconf -m prep SDfile
Find this compound or compounds like it in BindingDB:
Activity Spreadsheet -- Enzyme Inhibition Constant Data from BindingDB
Found 3 hits for monomerid = 50252692
TargetD(2) dopamine receptor(Homo sapiens (Human))
Università
Curated by ChEMBL
LigandPNGBDBM50252692(CHEMBL494661 | N-(4-Methanesulfonyloxyphenylmethyl...)
Affinity DataKi:  7.80nM. Assay description: Displacement of [3H]spiroperidol from human cloned dopamine D2L receptor expressed in rat C6 cells
In DepthDetails ArticlePubMed
Target5-hydroxytryptamine receptor 1A(Homo sapiens (Human))
Università
Curated by ChEMBL
LigandPNGBDBM50252692(CHEMBL494661 | N-(4-Methanesulfonyloxyphenylmethyl...)
Affinity DataKi:  57nM. Assay description: Displacement of [3H]8-OH-DPAT from human cloned 5HT1A receptor expressed in HEK293 cells
In DepthDetails ArticlePubMed
Target5-hydroxytryptamine receptor 7(Rattus norvegicus (rat))
Università
Curated by ChEMBL
LigandPNGBDBM50252692(CHEMBL494661 | N-(4-Methanesulfonyloxyphenylmethyl...)
Affinity DataKi:  76nM. Assay description: Displacement of [3H]LSD from rat cloned 5HT7 receptor expressed in HEK293 cells
In DepthDetails ArticlePubMed