BDBM50252728 (2'Z-3'E)-6-Bromoindirubin-3'-[O-(2-piperazine-1-ylethyl)oxime]::CHEMBL3216892::CHEMBL523714
SMILES Cl.Cl.OCCN1CCN(CCO\N=C2\C(\Nc3ccccc\23)=C2\C(=O)Nc3cc(Br)ccc23)CC1
InChI Key InChIKey=HJVDQPRJANOXIX-IVGNLCKYSA-N
Data  2 IC50
  Tab Delimited (TSV)   2D SDfile   Computed 3D by Vconf -m prep SDfile
Find this compound or compounds like it in BindingDB:
Activity Spreadsheet -- Enzyme Inhibition Constant Data from BindingDB
Found 2 hits for monomerid = 50252728
TargetCyclin-dependent kinase 1(Homo sapiens (Human))
University Of Athens
Curated by ChEMBL
LigandPNGBDBM50252728((2'Z-3'E)-6-Bromoindirubin-3'-[O-(2-piperazine-1-y...)
Affinity DataIC50:  400nM. Assay description: Inhibition of CDK1/cyclin B
In DepthDetails ArticlePubMed
TargetCyclin-dependent kinase 1(Homo sapiens (Human))
University Of Athens
Curated by ChEMBL
LigandPNGBDBM50252728((2'Z-3'E)-6-Bromoindirubin-3'-[O-(2-piperazine-1-y...)
Affinity DataIC50:  300nM. Assay description: Inhibition of CDK1/cyclin B
In DepthDetails ArticlePubMed