BDBM50252764 (2'Z-3'E)-6-Bromoindirubin-3'-{O-[2-(4-methyl-piperazin-1-yl)ethyl]oxime}::CHEMBL3216218::CHEMBL522537
SMILES Cl.Cl.CN1CCN(CCO\N=C2\C(\Nc3ccccc\23)=C2\C(=O)Nc3cc(Br)ccc23)CC1
InChI Key InChIKey=UWZGPKLUCAHSOA-DYGSTNMMSA-N
Data  2 IC50
  Tab Delimited (TSV)   2D SDfile   Computed 3D by Vconf -m prep SDfile
Find this compound or compounds like it in BindingDB:
Activity Spreadsheet -- Enzyme Inhibition Constant Data from BindingDB
Found 2 hits for monomerid = 50252764
TargetCyclin-dependent kinase 1(Homo sapiens (Human))
University Of Athens
Curated by ChEMBL
LigandPNGBDBM50252764((2'Z-3'E)-6-Bromoindirubin-3'-{O-[2-(4-methyl-pipe...)
Affinity DataIC50:  300nM. Assay description: Inhibition of CDK1/cyclin B
In DepthDetails ArticlePubMed
TargetCyclin-dependent kinase 1(Homo sapiens (Human))
University Of Athens
Curated by ChEMBL
LigandPNGBDBM50252764((2'Z-3'E)-6-Bromoindirubin-3'-{O-[2-(4-methyl-pipe...)
Affinity DataIC50:  400nM. Assay description: Inhibition of CDK1/cyclin B
In DepthDetails ArticlePubMed