BDBM50252855 (4S,7S,13S)-13-[(S)-3-(4-Carbamoyl-2,6-dimethyl-phenyl)-2-methyl-propionylamino]-7-(4-nitro-benzyl)-6,9,12-trioxo-1,2-dithia-5,8,11-triaza-cyclotetradecane-4-carboxylic acid amide::CHEMBL445869
SMILES C[C@@H](Cc1c(C)cc(cc1C)C(N)=O)C(=O)N[C@@H]1CSSC[C@@H](NC(=O)[C@H](Cc2ccc(cc2)[N+]([O-])=O)NC(=O)CNC1=O)C(N)=O
InChI Key InChIKey=NLFXDTKFNGHPEX-UYGLSEIWSA-N
Data  3 KI
  Tab Delimited (TSV)   2D SDfile   Computed 3D by Vconf -m prep SDfile
Find this compound or compounds like it in BindingDB:
Activity Spreadsheet -- Enzyme Inhibition Constant Data from BindingDB
Found 3 hits for monomerid = 50252855
TargetMu-type opioid receptor(Rattus norvegicus (rat))
National University Of Singapore
Curated by ChEMBL
LigandPNGBDBM50252855((4S,7S,13S)-13-[(S)-3-(4-Carbamoyl-2,6-dimethyl-ph...)
Affinity DataKi:  1.02nM. Assay description: Displacement of [3H]DAMGO from mu opioid receptor in rat brain membrane
In DepthDetails ArticlePubMed
TargetDelta-type opioid receptor(Rattus norvegicus (rat))
National University Of Singapore
Curated by ChEMBL
LigandPNGBDBM50252855((4S,7S,13S)-13-[(S)-3-(4-Carbamoyl-2,6-dimethyl-ph...)
Affinity DataKi:  19nM. Assay description: Displacement of [3H]DSLET from delta opioid receptor in rat brain membrane
In DepthDetails ArticlePubMed
TargetKappa-type opioid receptor(Cavia porcellus (domestic guinea pig))
National University Of Singapore
Curated by ChEMBL
LigandPNGBDBM50252855((4S,7S,13S)-13-[(S)-3-(4-Carbamoyl-2,6-dimethyl-ph...)
Affinity DataKi:  185nM. Assay description: Displacement of [3H]U69593 from kappa opioid receptor in guinea pig brain membrane
In DepthDetails ArticlePubMed