BDBM50253491 2-[4-(4-Bromophenyl)phenyl]-4-methyl-morphonyl-2-ol::CHEMBL492659
SMILES CN1CCOC(O)(C1)c1ccc(cc1)-c1ccc(Br)cc1
InChI Key InChIKey=NALOOEVGTGAOHW-UHFFFAOYSA-N
Data  1 IC50
  Tab Delimited (TSV)   2D SDfile   Computed 3D by Vconf -m prep SDfile
Find this compound or compounds like it in BindingDB:
Activity Spreadsheet -- Enzyme Inhibition Constant Data from BindingDB
Found 1 hit for monomerid = 50253491
TargetSqualene synthase(Rattus norvegicus)
University Of Athens
Curated by ChEMBL
LigandPNGBDBM50253491(2-[4-(4-Bromophenyl)phenyl]-4-methyl-morphonyl-2-o...)
Affinity DataIC50:  6.00E+3nM. Assay description: Inhibition of squalene synthase in rat liver microsome measured by convertion of [3H]FPP to squalene
In DepthDetails ArticlePubMed