BDBM50253571 CHEMBL4090776
SMILES Clc1ccc(NC(=O)Nc2ccc(CNc3nc4ccc(OCCN5CCOCC5)cc4s3)cc2)cc1Cl
InChI Key InChIKey=SZFSSULCXKPITO-UHFFFAOYSA-N
Data  1 IC50
  Tab Delimited (TSV)   2D SDfile   Computed 3D by Vconf -m prep SDfile
Find this compound or compounds like it in BindingDB:
Activity Spreadsheet -- Enzyme Inhibition Constant Data from BindingDB
Found 1 hit for monomerid = 50253571
TargetAurora kinase B(Homo sapiens (Human))
Sookmyung Women'S University
Curated by ChEMBL
LigandPNGBDBM50253571(CHEMBL4090776)
Affinity DataIC50:  270nM. Assay description: Inhibition of recombinant full length human N-terminal GST-tagged Aurora B expressed in baculovirus infected Sf9 cells using myelin basic protein as ...
Ligand InfoPC cidPC sid
In DepthDetails ArticlePubMed