BDBM50253749 CHEMBL506762::N-((1R)-1-[(4-Fluorophenyl)methyl]-2-{(2S)-4-[(1S)-2-(methylamino)-1-(2-naphthalenylmethyl)-2-oxoethyl]-3-oxo-2-propyl-1-piperazinyl}-2-oxoethyl)-4-piperidinecarboxamide
SMILES CCC[C@@H]1N(CCN([C@@H](Cc2ccc3ccccc3c2)C(=O)NC)C1=O)C(=O)[C@@H](Cc1ccc(F)cc1)NC(=O)C1CCNCC1
InChI Key InChIKey=DZBWWVGXDVRUHV-RTOKGZNSSA-N
Data  3 KI  3 EC50
  Tab Delimited (TSV)   2D SDfile   Computed 3D by Vconf -m prep SDfile
Find this compound or compounds like it in BindingDB:
Activity Spreadsheet -- Enzyme Inhibition Constant Data from BindingDB
Found 6 hits for monomerid = 50253749
TargetMelanocortin receptor 4(Homo sapiens (Human))
Procter & Gamble Pharmaceuticals
Curated by ChEMBL
LigandPNGBDBM50253749(CHEMBL506762 | N-((1R)-1-[(4-Fluorophenyl)methyl]-...)
Affinity DataKi:  5.20nM. Assay description: Displacement of europium-labeled NDP-alpha-MSH from human MC4R expressed in HEK293 cells
In DepthDetails ArticlePubMed
TargetMelanocyte-stimulating hormone receptor(Homo sapiens (Human))
Procter & Gamble Pharmaceuticals
Curated by ChEMBL
LigandPNGBDBM50253749(CHEMBL506762 | N-((1R)-1-[(4-Fluorophenyl)methyl]-...)
Affinity DataKi:  17nM. Assay description: Agonist activity at human MC1R expressed in HEK293 cells assessed as effect on CRE-driven luminescence by luciferase reporter gene assay
In DepthDetails ArticlePubMed
TargetMelanocortin receptor 3(Homo sapiens (Human))
Procter & Gamble Pharmaceuticals
Curated by ChEMBL
LigandPNGBDBM50253749(CHEMBL506762 | N-((1R)-1-[(4-Fluorophenyl)methyl]-...)
Affinity DataKi:  127nM. Assay description: Displacement of europium-labeled NDP-alpha-MSH from human MC3R expressed in HEK293 cells
In DepthDetails ArticlePubMed
TargetMelanocortin receptor 4(Homo sapiens (Human))
Procter & Gamble Pharmaceuticals
Curated by ChEMBL
LigandPNGBDBM50253749(CHEMBL506762 | N-((1R)-1-[(4-Fluorophenyl)methyl]-...)
Affinity DataEC50:  1.30nM. Assay description: Agonist activity at human MC4R expressed in HEK293 cells assessed as effect on CRE-driven luminescence by luciferase reporter gene assay
In DepthDetails ArticlePubMed
TargetMelanocyte-stimulating hormone receptor(Homo sapiens (Human))
Procter & Gamble Pharmaceuticals
Curated by ChEMBL
LigandPNGBDBM50253749(CHEMBL506762 | N-((1R)-1-[(4-Fluorophenyl)methyl]-...)
Affinity DataEC50:  10nM. Assay description: Agonist activity at human MC1R expressed in HEK293 cells assessed as effect on CRE-driven luminescence by luciferase reporter gene assay
In DepthDetails ArticlePubMed
TargetMelanocortin receptor 3(Homo sapiens (Human))
Procter & Gamble Pharmaceuticals
Curated by ChEMBL
LigandPNGBDBM50253749(CHEMBL506762 | N-((1R)-1-[(4-Fluorophenyl)methyl]-...)
Affinity DataEC50:  108nM. Assay description: Agonist activity at human MC3R expressed in HEK293 cells assessed as effect on CRE-driven luminescence by luciferase reporter gene assay
In DepthDetails ArticlePubMed