BDBM50253832 CHEMBL448624::Ethyl 5-amino-3-(4-iodophenyl)-4-oxo-3,4-dihydrothieno[3,4-d]pyridazine-1-carboxylate
SMILES CCOC(=O)c1nn(-c2ccc(I)cc2)c(=O)c2c(N)scc12
InChI Key InChIKey=QHJVWGMKHIFEDX-UHFFFAOYSA-N
Data  1 EC50
  Tab Delimited (TSV)   2D SDfile   Computed 3D by Vconf -m prep SDfile
Find this compound or compounds like it in BindingDB:
Activity Spreadsheet -- Enzyme Inhibition Constant Data from BindingDB
Found 1 hit for monomerid = 50253832
TargetAdenosine receptor A1(Homo sapiens (Human))
Monash University
Curated by ChEMBL
LigandPNGBDBM50253832(CHEMBL448624 | Ethyl 5-amino-3-(4-iodophenyl)-4-ox...)
Affinity DataEC50:  7.10E+3nM. Assay description: Modulation of human adenosine A1 receptor expressed in CHO-K1 cells assessed as allosteric effect on [125I]ABA dissociation
In DepthDetails ArticlePubMed