BDBM50253905 3-(4-(4-Fluorophenyl)-5-(2-(sec-butylamino)pyridin-4-yl)-1H-imidazol-2-ylthio)propane-1,2-diol::CHEMBL518628
SMILES CCC(C)Nc1cc(ccn1)-c1nc(SCC(O)CO)[nH]c1-c1ccc(F)cc1
InChI Key InChIKey=GMZIOTLCLOPOAC-UHFFFAOYSA-N
Data  1 IC50
  Tab Delimited (TSV)   2D SDfile   Computed 3D by Vconf -m prep SDfile
Find this compound or compounds like it in BindingDB:
Activity Spreadsheet -- Enzyme Inhibition Constant Data from BindingDB
Found 1 hit for monomerid = 50253905
TargetMitogen-activated protein kinase 14(Homo sapiens (Human))
Eberhard-Karls University Of TüBingen
Curated by ChEMBL
LigandPNGBDBM50253905(3-(4-(4-Fluorophenyl)-5-(2-(sec-butylamino)pyridin...)
Affinity DataIC50:  5nM. Assay description: Inhibition of p38alpha (unknown origin)
In DepthDetails ArticlePubMed