BDBM50253939 2-[4-(2-Benzothiazolyl)phenyl]-4-methylmorpholin-2-ol::CHEMBL462257
SMILES CN1CCOC(O)(C1)c1ccc(cc1)-c1nc2ccccc2s1
InChI Key InChIKey=PJEBUKBZVKAKLF-UHFFFAOYSA-N
Data  1 IC50
  Tab Delimited (TSV)   2D SDfile   Computed 3D by Vconf -m prep SDfile
Find this compound or compounds like it in BindingDB:
Activity Spreadsheet -- Enzyme Inhibition Constant Data from BindingDB
Found 1 hit for monomerid = 50253939
TargetSqualene synthase(Rattus norvegicus)
University Of Athens
Curated by ChEMBL
LigandPNGBDBM50253939(2-[4-(2-Benzothiazolyl)phenyl]-4-methylmorpholin-2...)
Affinity DataIC50:  2.00E+3nM. Assay description: Inhibition of squalene synthase in rat liver microsome measured by convertion of [3H]FPP to squalene
In DepthDetails ArticlePubMed