BDBM50254223 CHEMBL4077313
SMILES CCc1ccccc1COc1ccccc1-c1nc2cccnc2o1
InChI Key InChIKey=YQWHDBXINQBYNV-UHFFFAOYSA-N
Data  1 IC50
  Tab Delimited (TSV)   2D SDfile   Computed 3D by Vconf -m prep SDfile
Find this compound or compounds like it in BindingDB:
Activity Spreadsheet -- Enzyme Inhibition Constant Data from BindingDB
Found 1 hit for monomerid = 50254223
TargetPhosphatidylcholine:ceramide cholinephosphotransferase 2(Homo sapiens (Human))
Fudan University
Curated by ChEMBL
LigandPNGBDBM50254223(CHEMBL4077313)
Affinity DataIC50:  5.00E+3nM. Assay description: Inhibition of purified SMS2 (unknown origin) pre-incubated for 5 mins followed by DMPC and C6-NBD-ceramide addition and measured after 30 mins by HPL...
In DepthDetails ArticlePubMed