BDBM50254299 3-(2,5-Difluorobenzyl)-7-(2-furyl)-3H-[1,2,3]triazolo[4,5-d]pyrimidine-5-amine::CHEMBL467245
SMILES Nc1nc(-c2ccco2)c2nnn(Cc3cc(F)ccc3F)c2n1
InChI Key InChIKey=HIKPTKYPQANVTC-UHFFFAOYSA-N
Data  4 KI
  Tab Delimited (TSV)   2D SDfile   Computed 3D by Vconf -m prep SDfile
Find this compound or compounds like it in BindingDB:
Activity Spreadsheet -- Enzyme Inhibition Constant Data from BindingDB
Found 4 hits for monomerid = 50254299
TargetAdenosine receptor A2a(Homo sapiens (Human))
Vernalis R&D
Curated by ChEMBL
LigandPNGBDBM50254299(3-(2,5-Difluorobenzyl)-7-(2-furyl)-3H-[1,2,3]triaz...)
Affinity DataKi:  2.20nM. Assay description: Displacement of radioligand from human recombinant adenosine A2A receptor at 21 degC after 90 mins by cell-based microplate scintillation counting
In DepthDetails ArticlePubMed
TargetAdenosine receptor A1(Homo sapiens (Human))
Vernalis R&D
Curated by ChEMBL
LigandPNGBDBM50254299(3-(2,5-Difluorobenzyl)-7-(2-furyl)-3H-[1,2,3]triaz...)
Affinity DataKi:  98nM. Assay description: Displacement of radioligand from human recombinant adenosine A1 receptor at 21 degC after 90 mins by cell-based microplate scintillation counting
In DepthDetails ArticlePubMed
TargetAdenosine receptor A2b(Homo sapiens (Human))
Vernalis R&D
Curated by ChEMBL
LigandPNGBDBM50254299(3-(2,5-Difluorobenzyl)-7-(2-furyl)-3H-[1,2,3]triaz...)
Affinity DataKi:  128nM. Assay description: Displacement of radioligand from human recombinant adenosine A2B receptor at 21 degC after 60 mins by cell-based microplate scintillation counting
In DepthDetails ArticlePubMed
TargetAdenosine receptor A3(Homo sapiens (Human))
Vernalis R&D
Curated by ChEMBL
LigandPNGBDBM50254299(3-(2,5-Difluorobenzyl)-7-(2-furyl)-3H-[1,2,3]triaz...)
Affinity DataKi:  450nM. Assay description: Displacement of radioligand from human recombinant adenosine A3 receptor at 21 degC after 60 mins by cell-based microplate scintillation counting
In DepthDetails ArticlePubMed