BDBM50254381 2-(4-methoxyphenyl)-6-(4-oxo-2-phenyl-4H-chromen-7-yloxy)-4H-chromen-4-one::CHEMBL466807
SMILES COc1ccc(cc1)-c1cc(=O)c2cc(Oc3ccc4c(c3)oc(cc4=O)-c3ccccc3)ccc2o1
InChI Key InChIKey=UQNBBBQCELYTOB-UHFFFAOYSA-N
Data  1 IC50
  Tab Delimited (TSV)   2D SDfile   Computed 3D by Vconf -m prep SDfile
Find this compound or compounds like it in BindingDB:
Activity Spreadsheet -- Enzyme Inhibition Constant Data from BindingDB
Found 1 hit for monomerid = 50254381
TargetProstaglandin G/H synthase 2(Mus musculus (Mouse))
Kangwon National University
Curated by ChEMBL
LigandPNGBDBM50254381(2-(4-methoxyphenyl)-6-(4-oxo-2-phenyl-4H-chromen-7...)
Affinity DataIC50:  2.00E+3nM. Assay description: Inhibition of COX2-mediated PGE2 production in LPS-stimulated mouse RAW264.7 cells by ELISA
In DepthDetails ArticlePubMed