BDBM50254391 (2S)-(3'-Phosphonomethylbicyclo[1.1.1]pentyl)glycine::CHEMBL445241
SMILES N[C@@H](CC12CC(CP(O)(O)=O)(C1)C2)C(O)=O
InChI Key InChIKey=RTCJYOUKEOFKFL-GVWIPJJGSA-N
Data  3 KI
  Tab Delimited (TSV)   2D SDfile   Computed 3D by Vconf -m prep SDfile
Find this compound or compounds like it in BindingDB:
Activity Spreadsheet -- Enzyme Inhibition Constant Data from BindingDB
Found 3 hits for monomerid = 50254391
TargetMetabotropic glutamate receptor 1(Homo sapiens (Human))
Universit£
Curated by ChEMBL
LigandPNGBDBM50254391((2S)-(3'-Phosphonomethylbicyclo[1.1.1]pentyl)glyci...)
Affinity DataKi: >3.00E+5nM. Assay description: Displacement of [3H]Quisqualate from human mGluR1A receptor expressed in BHK cells
In DepthDetails ArticlePubMed
TargetMetabotropic glutamate receptor 5(Homo sapiens (Human))
Universit£
Curated by ChEMBL
LigandPNGBDBM50254391((2S)-(3'-Phosphonomethylbicyclo[1.1.1]pentyl)glyci...)
Affinity DataKi: >3.00E+5nM. Assay description: Displacement of [3H]Quisqualate from human mGluR5 receptor expressed in BHK cells
In DepthDetails ArticlePubMed
TargetMetabotropic glutamate receptor 4(Homo sapiens (Human))
Universit£
Curated by ChEMBL
LigandPNGBDBM50254391((2S)-(3'-Phosphonomethylbicyclo[1.1.1]pentyl)glyci...)
Affinity DataKi: >1.00E+6nM. Assay description: Displacement of [3H]Quisqualate from human mGluR4 receptor expressed in BHK cells
In DepthDetails ArticlePubMed