BDBM50254479 7-(3,4-dichlorophenyl)-5-methyl-N-propyl-4,7-dihydropyrazolo[1,5-a]pyrimidine-6-carboxamide::CHEMBL447625
SMILES CCCNC(=O)C1C(c2ccc(Cl)c(Cl)c2)n2nccc2N=C1C
InChI Key InChIKey=UOGTZDGSELFLDY-UHFFFAOYSA-N
Data  1 IC50
  Tab Delimited (TSV)   2D SDfile   Computed 3D by Vconf -m prep SDfile
Find this compound or compounds like it in BindingDB:
Activity Spreadsheet -- Enzyme Inhibition Constant Data from BindingDB
Found 1 hit for monomerid = 50254479
TargetPotassium voltage-gated channel subfamily A member 5(Homo sapiens (Human))
Bristol-Myers Squibb
Curated by ChEMBL
LigandPNGBDBM50254479(7-(3,4-dichlorophenyl)-5-methyl-N-propyl-4,7-dihyd...)
Affinity DataIC50:  490nM. Assay description: Inhibition of human Kv1.5 channel expressed in mouse L929 cells by EP voltage clamp technique
In DepthDetails ArticlePubMed