BDBM50254512 (1S,5R,13R,14S,17S)-4-(cyclopropylmethyl)-14,17-dihydroxy-12-oxa-4-azapentacyclo[9.6.1.0^{1,13}.0^{5,17}.0^{7,18}]octadeca-7,9,11(18)-triene-10-carboxamide::CHEMBL511588
SMILES NC(=O)c1ccc2C[C@H]3N(CC4CC4)CC[C@@]45[C@@H](Oc1c24)[C@@H](O)CC[C@@]35O
InChI Key InChIKey=YQOPEESTHCLTGK-MXUFIIGOSA-N
Data  3 KI
  Tab Delimited (TSV)   2D SDfile   Computed 3D by Vconf -m prep SDfile
Find this compound or compounds like it in BindingDB:
Activity Spreadsheet -- Enzyme Inhibition Constant Data from BindingDB
Found 3 hits for monomerid = 50254512
TargetMu-type opioid receptor(Homo sapiens (Human))
Rensselaer Polytechnic Institute
Curated by ChEMBL
LigandPNGBDBM50254512((1S,5R,13R,14S,17S)-4-(cyclopropylmethyl)-14,17-di...)
Affinity DataKi:  7.10nM. Assay description: Activity at human cloned mu opioid receptor expressed in CHO cells by [35S]GTPgammaS binding assay
In DepthDetails ArticlePubMed
TargetKappa-type opioid receptor(Homo sapiens (Human))
Rensselaer Polytechnic Institute
Curated by ChEMBL
LigandPNGBDBM50254512((1S,5R,13R,14S,17S)-4-(cyclopropylmethyl)-14,17-di...)
Affinity DataKi:  100nM. Assay description: Activity at human cloned kappa opioid receptor expressed in CHO cells by [35S]GTPgammaS binding assay
In DepthDetails ArticlePubMed
TargetDelta-type opioid receptor(Homo sapiens (Human))
Rensselaer Polytechnic Institute
Curated by ChEMBL
LigandPNGBDBM50254512((1S,5R,13R,14S,17S)-4-(cyclopropylmethyl)-14,17-di...)
Affinity DataKi: >1.00E+4nM. Assay description: Displacement of [3H]Naltrindole form human delta opioid receptor expressed in CHO cells
In DepthDetails ArticlePubMed