BDBM50254708 4'-Chloro-biphenyl-3,5-dicarboxylic acid 3-[((1S,2R)-1-benzyl-3-cyclopropylamino-2-hydroxy-propyl)-amide] 5-[((R)-1-phenyl-ethyl)-amide]::CHEMBL443447
SMILES C[C@@H](NC(=O)c1cc(cc(c1)-c1ccc(Cl)cc1)C(=O)N[C@@H](Cc1ccccc1)[C@H](O)CNC1CC1)c1ccccc1
InChI Key InChIKey=BKWNRLGMNHZAMD-UMJMCJBLSA-N
Data  2 IC50
  Tab Delimited (TSV)   2D SDfile   Computed 3D by Vconf -m prep SDfile
Find this compound or compounds like it in BindingDB:
Activity Spreadsheet -- Enzyme Inhibition Constant Data from BindingDB
Found 2 hits for monomerid = 50254708
TargetBeta-secretase 2(Homo sapiens (Human))
University Of Illinois At Chicago
Curated by ChEMBL
LigandPNGBDBM50254708(4'-Chloro-biphenyl-3,5-dicarboxylic acid 3-[((1S,2...)
Affinity DataIC50: >1.00E+5nM. Assay description: Inhibition of BACE2 expressed in human 293T cells
In DepthDetails ArticlePubMed
TargetBeta-secretase 1(Homo sapiens (Human))
University Of Illinois At Chicago
Curated by ChEMBL
LigandPNGBDBM50254708(4'-Chloro-biphenyl-3,5-dicarboxylic acid 3-[((1S,2...)
Affinity DataIC50:  811nM. Assay description: Inhibition of BACE1 (unknown origin) expressed in human 293T cells
In DepthDetails ArticlePubMed