BDBM50254747 CHEMBL463865::N4-((2S,3R)-4-(cyclopropylamino)-3-hydroxy-1-phenylbutan-2-yl)-2-methyl-N6-((R)-1-phenylethyl)benzofuran-4,6-dicarboxamide
SMILES C[C@@H](NC(=O)c1cc(C(=O)N[C@@H](Cc2ccccc2)[C@H](O)CNC2CC2)c2cc(C)oc2c1)c1ccccc1
InChI Key InChIKey=RYLYLEZYSLPXSS-SPTGULJVSA-N
Data  2 IC50
  Tab Delimited (TSV)   2D SDfile   Computed 3D by Vconf -m prep SDfile
Find this compound or compounds like it in BindingDB:
Activity Spreadsheet -- Enzyme Inhibition Constant Data from BindingDB
Found 2 hits for monomerid = 50254747
TargetBeta-secretase 2(Homo sapiens (Human))
University Of Illinois At Chicago
Curated by ChEMBL
LigandPNGBDBM50254747(CHEMBL463865 | N4-((2S,3R)-4-(cyclopropylamino)-3-...)
Affinity DataIC50: >1.00E+5nM. Assay description: Inhibition of BACE2 expressed in human 293T cells
In DepthDetails ArticlePubMed
TargetBeta-secretase 1(Homo sapiens (Human))
University Of Illinois At Chicago
Curated by ChEMBL
LigandPNGBDBM50254747(CHEMBL463865 | N4-((2S,3R)-4-(cyclopropylamino)-3-...)
Affinity DataIC50:  998nM. Assay description: Inhibition of BACE1 (unknown origin) expressed in human 293T cells
In DepthDetails ArticlePubMed