BDBM50254821 CHEMBL4070829
SMILES Cc1cc(Nc2ccc(Cl)cc2C)nc(N)n1
InChI Key InChIKey=REMZIOVPCUQKMO-UHFFFAOYSA-N
Data  1 IC50
  Tab Delimited (TSV)   2D SDfile   Computed 3D by Vconf -m prep SDfile
Find this compound or compounds like it in BindingDB:
Activity Spreadsheet -- Enzyme Inhibition Constant Data from BindingDB
Found 1 hit for monomerid = 50254821
TargetS-adenosylmethionine decarboxylase proenzyme(Homo sapiens (Human))
Scynexis
Curated by ChEMBL
LigandPNGBDBM50254821(CHEMBL4070829)
Affinity DataIC50: >1.80E+5nM. Assay description: Inhibition of recombinant human N-terminal His6-tagged AdoMetDC expressed in Escherichia coli BL21/DE3 cells at pH 7.2 by RapidFire-MS-based enzyme a...
In DepthDetails ArticlePubMed