BDBM50255194 CHEMBL481465::N1-{(+/-)-4'-[(6''-amino-4''-methylpyridin-2''-yl)methyl]pyrrolidin-3'-yl}ethane-1,2-diamine tetrahydrochloride::US9090589, 5
SMILES Cc1cc(N)nc(C[C@H]2CNC[C@H]2NCCN)c1
InChI Key InChIKey=DTZKWWOYTUJCTB-CMPLNLGQSA-N
Data  6 KI
  Tab Delimited (TSV)   2D SDfile   Computed 3D by Vconf -m prep SDfile
Find this compound or compounds like it in BindingDB:
Activity Spreadsheet -- Enzyme Inhibition Constant Data from BindingDB
Found 6 hits for monomerid = 50255194
TargetNitric oxide synthase, brain(Homo sapiens (Human))
Northwestern University
US Patent
LigandPNGBDBM50255194(CHEMBL481465 | N1-{(+/-)-4'-[(6''-amino-4''-methyl...)
Affinity DataKi:  98nM. Assay description: Recombinant NOS isozymes over-expressed in E. coli were utilized. (Ji, H., et al., Discovery of highly potent and selective inhibitors of neuronal ni...
In DepthDetails US Patent
TargetNitric oxide synthase, brain(Rattus norvegicus (rat))
Northwestern University
Curated by ChEMBL
LigandPNGBDBM50255194(CHEMBL481465 | N1-{(+/-)-4'-[(6''-amino-4''-methyl...)
Affinity DataKi:  98nM. Assay description: Inhibition of rat recombinant nNOS expressed in Escherichia coli by hemoglobin capture assay
In DepthDetails ArticlePubMed
TargetNitric oxide synthase, inducible(Homo sapiens (Human))
Northwestern University
US Patent
LigandPNGBDBM50255194(CHEMBL481465 | N1-{(+/-)-4'-[(6''-amino-4''-methyl...)
Affinity DataKi:  5.84E+3nM. Assay description: Recombinant NOS isozymes over-expressed in E. coli were utilized. (Ji, H., et al., Discovery of highly potent and selective inhibitors of neuronal ni...
In DepthDetails US Patent
TargetNitric oxide synthase, inducible(Mus musculus (mouse))
Northwestern University
Curated by ChEMBL
LigandPNGBDBM50255194(CHEMBL481465 | N1-{(+/-)-4'-[(6''-amino-4''-methyl...)
Affinity DataKi:  5.84E+3nM. Assay description: Inhibition of mouse recombinant iNOS expressed in Escherichia coli by hemoglobin capture assay
In DepthDetails ArticlePubMed
TargetNitric oxide synthase, endothelial(Homo sapiens (Human))
Northwestern University
US Patent
LigandPNGBDBM50255194(CHEMBL481465 | N1-{(+/-)-4'-[(6''-amino-4''-methyl...)
Affinity DataKi:  2.83E+5nM. Assay description: Recombinant NOS isozymes over-expressed in E. coli were utilized. (Ji, H., et al., Discovery of highly potent and selective inhibitors of neuronal ni...
In DepthDetails US Patent
TargetNitric oxide synthase, endothelial(Bos taurus (bovine))
Northwestern University
Curated by ChEMBL
LigandPNGBDBM50255194(CHEMBL481465 | N1-{(+/-)-4'-[(6''-amino-4''-methyl...)
Affinity DataKi:  2.83E+5nM. Assay description: Inhibition of bovine recombinant eNOS expressed in Escherichia coli by hemoglobin capture assay
In DepthDetails ArticlePubMed