BDBM50255200 4-Bromo-1-(4-chloro-benzyl)-2-methyl-5-phenyl-1H-pyrrole-3-carboxylic acid adamantan-2-ylamide::CHEMBL519302
SMILES Cc1c(C(=O)NC2C3CC4CC(C3)CC2C4)c(Br)c(-c2ccccc2)n1Cc1ccc(Cl)cc1
InChI Key InChIKey=ARAMNTUIECTTLT-UHFFFAOYSA-N
Data  2 IC50
  Tab Delimited (TSV)   2D SDfile   Computed 3D by Vconf -m prep SDfile
Find this compound or compounds like it in BindingDB:
Activity Spreadsheet -- Enzyme Inhibition Constant Data from BindingDB
Found 2 hits for monomerid = 50255200
TargetCannabinoid receptor 2(Homo sapiens (Human))
University Of California
Curated by ChEMBL
LigandPNGBDBM50255200(4-Bromo-1-(4-chloro-benzyl)-2-methyl-5-phenyl-1H-p...)
Affinity DataIC50:  123nM. Assay description: Displacement of [3H]WIN55,212-2 from human CB2 receptor expressed in CHO-K1 cells by liquid scintillation counting
In DepthDetails ArticlePubMed
TargetCannabinoid receptor 1(Rattus norvegicus (rat))
University Of California
Curated by ChEMBL
LigandPNGBDBM50255200(4-Bromo-1-(4-chloro-benzyl)-2-methyl-5-phenyl-1H-p...)
Affinity DataIC50: >1.00E+3nM. Assay description: Displacement of [3H]WIN55,212-2 from CB1 receptor in rat cerebellar membrane by liquid scintillation counting
In DepthDetails ArticlePubMed