BDBM50255389 CHEMBL4072781
SMILES N[C@@H](CCP(O)(=O)[C@H](O)c1cccc(c1)[N+]([O-])=O)C(O)=O
InChI Key InChIKey=CAYKXAFYYYAPJS-ONGXEEELSA-N
Data  4 EC50
  Tab Delimited (TSV)   2D SDfile   Computed 3D by Vconf -m prep SDfile
Find this compound or compounds like it in BindingDB:
Activity Spreadsheet -- Enzyme Inhibition Constant Data from BindingDB
Found 4 hits for monomerid = 50255389
TargetMetabotropic glutamate receptor 8(Homo sapiens (Human))
University Of Paris
Curated by ChEMBL
LigandPNGBDBM50255389(CHEMBL4072781)
Affinity DataEC50:  1.25E+3nM. Assay description: Agonist activity at mGlu8 (unknown origin) expressed in HEK293 cells coexpressing chimeric Gq/i protein assessed as increase in intracellular calcium...
In DepthDetails ArticlePubMed
TargetMetabotropic glutamate receptor 6(Homo sapiens (Human))
University Of Paris
Curated by ChEMBL
LigandPNGBDBM50255389(CHEMBL4072781)
Affinity DataEC50:  2.40E+3nM. Assay description: Agonist activity at mGlu6 (unknown origin) expressed in HEK293 cells coexpressing chimeric Gq/i protein assessed as increase in intracellular calcium...
In DepthDetails ArticlePubMed
TargetMetabotropic glutamate receptor 7(Homo sapiens (Human))
University Of Paris
Curated by ChEMBL
LigandPNGBDBM50255389(CHEMBL4072781)
Affinity DataEC50: >1.00E+5nM. Assay description: Agonist activity at mGlu7 (unknown origin) expressed in HEK293 cells coexpressing chimeric Gq/i protein assessed as increase in intracellular calcium...
In DepthDetails ArticlePubMed
TargetMetabotropic glutamate receptor 4(Homo sapiens (Human))
University Of Paris
Curated by ChEMBL
LigandPNGBDBM50255389(CHEMBL4072781)
Affinity DataEC50:  1.00E+3nM. Assay description: Agonist activity at mGlu4 (unknown origin) expressed in HEK293 cells coexpressing chimeric Gq/i protein assessed as increase in intracellular calcium...
In DepthDetails ArticlePubMed