BDBM50255431 4-(trifluoromethyl)phenyl 4-(5-(allyl(methyl)amino)pentyl)cyclohexyl(methyl)carbamate 2-hydroxypropane-1,2,3-tricarboxylate::CHEMBL448434
SMILES CN(CCCCC[C@H]1CC[C@@H](CC1)N(C)C(=O)Oc1ccc(cc1)C(F)(F)F)CC=C
InChI Key InChIKey=QTPDFYJYCCDNKD-XUTJKUGGSA-N
Data  4 IC50
  Tab Delimited (TSV)   2D SDfile   Computed 3D by Vconf -m prep SDfile
Find this compound or compounds like it in BindingDB:
Activity Spreadsheet -- Enzyme Inhibition Constant Data from BindingDB
Found 4 hits for monomerid = 50255431
TargetLanosterol synthase ERG7(Saccharomyces cerevisiae)
Università
Curated by ChEMBL
LigandPNGBDBM50255431(4-(trifluoromethyl)phenyl 4-(5-(allyl(methyl)amino...)
Affinity DataIC50:  50nM. Assay description: Inhibition of yeast OSC expressed in Saccharomyces cerevisiae SMY8
In DepthDetails ArticlePubMed
TargetLanosterol synthase(Homo sapiens (Human))
Centre Hospitalier Universitaire Vaudois (Chuv) And University Of Lausanne (Unil
Curated by ChEMBL
LigandPNGBDBM50255431(4-(trifluoromethyl)phenyl 4-(5-(allyl(methyl)amino...)
Affinity DataIC50:  5nM. Assay description: Inhibition of human liver microsome 2,3-OSC after 1 hr by Silica gel plate phosphor imaging
In DepthDetails ArticlePubMed
TargetCycloartenol synthase(Arabidopsis thaliana)
Università
Curated by ChEMBL
LigandPNGBDBM50255431(4-(trifluoromethyl)phenyl 4-(5-(allyl(methyl)amino...)
Affinity DataIC50:  1.00E+3nM. Assay description: Inhibition of Arabidopsis thaliana cycloartenol synthase expressed in Saccharomyces cerevisiae SMY8
In DepthDetails ArticlePubMed
TargetLanosterol synthase(Homo sapiens (Human))
Centre Hospitalier Universitaire Vaudois (Chuv) And University Of Lausanne (Unil
Curated by ChEMBL
LigandPNGBDBM50255431(4-(trifluoromethyl)phenyl 4-(5-(allyl(methyl)amino...)
Affinity DataIC50:  140nM. Assay description: Inhibition of human OSC expressed in Saccharomyces cerevisiae SMY8
In DepthDetails ArticlePubMed