BDBM50255500 CHEMBL475269::N-[1-(2S-Ethyl-4-oxo-tetrahydro-furan-3S-ylcarbamoyl)-2S-(1-methyl-cyclopentyl)-ethyl]-4-(4-methoxy-benzenesulfonylamino)-benzamide
SMILES CC[C@@H]1OCC(=O)[C@H]1NC(=O)[C@H](CC1(C)CCCC1)NC(=O)c1ccc(NS(=O)(=O)c2ccc(OC)cc2)cc1
InChI Key InChIKey=DRNQQVHLNODFOO-AYRHNUGRSA-N
Data  3 KI
  Tab Delimited (TSV)   2D SDfile   Computed 3D by Vconf -m prep SDfile
Find this compound or compounds like it in BindingDB:
Activity Spreadsheet -- Enzyme Inhibition Constant Data from BindingDB
Found 3 hits for monomerid = 50255500
TargetCathepsin S(Homo sapiens (Human))
Medivir
Curated by ChEMBL
LigandPNGBDBM50255500(CHEMBL475269 | N-[1-(2S-Ethyl-4-oxo-tetrahydro-fur...)
Affinity DataKi:  3.30nM. Assay description: Inhibition of human recombinant cathepsin S expressed in baculovirus by fluorescence assay
In DepthDetails ArticlePubMed
TargetCathepsin K(Homo sapiens (Human))
Medivir
Curated by ChEMBL
LigandPNGBDBM50255500(CHEMBL475269 | N-[1-(2S-Ethyl-4-oxo-tetrahydro-fur...)
Affinity DataKi:  500nM. Assay description: Inhibition of human recombinant cathepsin K expressed in baculovirus by fluorescence assay
In DepthDetails ArticlePubMed
TargetProcathepsin L(Homo sapiens (Human))
Medivir
Curated by ChEMBL
LigandPNGBDBM50255500(CHEMBL475269 | N-[1-(2S-Ethyl-4-oxo-tetrahydro-fur...)
Affinity DataKi:  1.10E+4nM. Assay description: Inhibition of human cathepsin L by fluorescence assay
In DepthDetails ArticlePubMed