BDBM50255508 CHEMBL4084474
SMILES CC(C)S(=O)(=O)c1c(Cl)ccc(NC(=O)NC2CCC(C)C2)c1O
InChI Key InChIKey=SMUKAUYOSDQMCW-UHFFFAOYSA-N
Data  1 IC50
  Tab Delimited (TSV)   2D SDfile   Computed 3D by Vconf -m prep SDfile
Find this compound or compounds like it in BindingDB:
Activity Spreadsheet -- Enzyme Inhibition Constant Data from BindingDB
Found 1 hit for monomerid = 50255508
TargetC-X-C chemokine receptor type 2(Homo sapiens (Human))
Gsk Pharmaceuticals R & D
Curated by ChEMBL
LigandPNGBDBM50255508(CHEMBL4084474)
Affinity DataIC50:  200nM. Assay description: Antagonist activity at TEV protease cleavage site linked GAL4-VP16-fused recombinant human CXCR2 expressed in cells assessed as inhibition of TEV pro...
In DepthDetails ArticlePubMed