BDBM50255513 4-(3,5-dichlorophenylamino)-6,7-dimethoxyquinoline-3-carboxamide::CHEMBL479267
SMILES COc1cc2ncc(C(N)=O)c(Nc3cc(Cl)cc(Cl)c3)c2cc1OC
InChI Key InChIKey=LXDSESRXFCMAFN-UHFFFAOYSA-N
Data  1 IC50
  Tab Delimited (TSV)   2D SDfile   Computed 3D by Vconf -m prep SDfile
Find this compound or compounds like it in BindingDB:
Activity Spreadsheet -- Enzyme Inhibition Constant Data from BindingDB
Found 1 hit for monomerid = 50255513
TargetMacrophage colony-stimulating factor 1 receptor(Homo sapiens (Human))
Astrazeneca R&D Boston
Curated by ChEMBL
LigandPNGBDBM50255513(4-(3,5-dichlorophenylamino)-6,7-dimethoxyquinoline...)
Affinity DataIC50:  22nM. Assay description: Inhibition of His-tagged CSF1R catalytic domain (unknown origin) expressed in baculovirus by HTRF assay
In DepthDetails ArticlePubMed