BDBM50255883 CHEMBL4096988
SMILES [H][C@@]12CN(C)C[C@]1([H])CN(C2)c1ccc(Nc2ncc3CN(C(=O)N([C@H]4CCN(C4)C(=O)CC)c3n2)c2cc(OC)ccc2F)cc1C
InChI Key InChIKey=JRBHAMSQIVUWKS-GSLIJJQTSA-N
Data  2 IC50
  Tab Delimited (TSV)   2D SDfile   Computed 3D by Vconf -m prep SDfile
Find this compound or compounds like it in BindingDB:
Activity Spreadsheet -- Enzyme Inhibition Constant Data from BindingDB
Found 2 hits for monomerid = 50255883
TargetEpidermal growth factor receptor(Homo sapiens (Human))
Chinese Academy Of Sciences
Curated by ChEMBL
LigandPNGBDBM50255883(CHEMBL4096988)
Affinity DataIC50:  216nM. Assay description: Inhibition of recombinant human wild type GST-tagged EGFR cytoplasmic domain (668 to 1210 residues) expressed in baculovirus using tyr4 peptide as su...
In DepthDetails ArticlePubMed
TargetMacrophage colony-stimulating factor 1 receptor(Homo sapiens (Human))
Chinese Academy Of Sciences
Curated by ChEMBL
LigandPNGBDBM50255883(CHEMBL4096988)
Affinity DataIC50:  7nM. Assay description: Inhibition of recombinant human His-tagged CSF1R cytoplasmic domain (538 to 910 residues) expressed in baculovirus using tyr4 peptide as substrate af...
In DepthDetails ArticlePubMed