BDBM50256380 CHEMBL482357::methyl 3-(4-cyanonaphthalen-1-ylimino)-2-oxa-4-azaspiro[5.5]undecane-4-carbodithioate
SMILES CSC(=S)N1CC2(CCCCC2)CO\C1=N/c1ccc(C#N)c2ccccc12
InChI Key InChIKey=AJDTVHHXNKJGAN-GFMRDNFCSA-N
Data  2 KI
  Tab Delimited (TSV)   2D SDfile   Computed 3D by Vconf -m prep SDfile
Find this compound or compounds like it in BindingDB:
Activity Spreadsheet -- Enzyme Inhibition Constant Data from BindingDB
Found 2 hits for monomerid = 50256380
TargetCannabinoid receptor 2(Homo sapiens (Human))
Shionogi
Curated by ChEMBL
LigandPNGBDBM50256380(CHEMBL482357 | methyl 3-(4-cyanonaphthalen-1-ylimi...)
Affinity DataKi:  1.80nM. Assay description: Binding affinity to human CB2 receptor
In DepthDetails ArticlePubMed
TargetCannabinoid receptor 1(Homo sapiens (Human))
Shionogi
Curated by ChEMBL
LigandPNGBDBM50256380(CHEMBL482357 | methyl 3-(4-cyanonaphthalen-1-ylimi...)
Affinity DataKi:  9.20nM. Assay description: Binding affinity to human CB1 receptor
In DepthDetails ArticlePubMed