BDBM50256651 13-(2-Chloro-6-fluoro-benzyl)-9,10-dimethoxy-5,6-dihydro-[1,3]dioxolo[4,5-g]isoquino[3,2-a]isoquinolin-7-ylium chloride::CHEMBL475452
SMILES COc1ccc2c(Cc3c(F)cccc3Cl)c3-c4cc5OCOc5cc4CC[n+]3cc2c1OC
InChI Key InChIKey=OBVJOUIGKDWJIL-UHFFFAOYSA-N
Data  1 IC50
  Tab Delimited (TSV)   2D SDfile   Computed 3D by Vconf -m prep SDfile
Find this compound or compounds like it in BindingDB:
Activity Spreadsheet -- Enzyme Inhibition Constant Data from BindingDB
Found 1 hit for monomerid = 50256651
TargetP2X purinoceptor 7(Homo sapiens (Human))
Institute Of Science And Technology (Gist)
Curated by ChEMBL
LigandPNGBDBM50256651(13-(2-Chloro-6-fluoro-benzyl)-9,10-dimethoxy-5,6-d...)
Affinity DataIC50:  400nM. Assay description: Antagonist activity at human P2X7 receptor expressed in HEK293 cells assessed as inhibition of BzATP-induced fluorescent ethidium accumulation
In DepthDetails ArticlePubMed