BDBM50257341 CHEMBL4094447
SMILES Cn1c(CNc2cccc(c2)C(=O)NCc2ccccc2C(F)(F)F)nnc1-c1ccncn1
InChI Key InChIKey=DFYJVEZNHJSNLL-UHFFFAOYSA-N
Data  3 IC50  1 EC50
  Tab Delimited (TSV)   2D SDfile   Computed 3D by Vconf -m prep SDfile
Find this compound or compounds like it in BindingDB:
Activity Spreadsheet -- Enzyme Inhibition Constant Data from BindingDB
Found 4 hits for monomerid = 50257341
TargetProtein kinase C alpha type(Homo sapiens (Human))
Takeda Pharmaceutical
Curated by ChEMBL
LigandPNGBDBM50257341(CHEMBL4094447)
Affinity DataIC50: >1.00E+4nM. Assay description: Inhibition of human PKCalpha active using MBP as substrate after 60 mins in presence of [gamma-32]ATP by scintillation counting
In DepthDetails ArticlePubMed
TargetBeta-adrenergic receptor kinase 1(Homo sapiens (Human))
Takeda Pharmaceutical
Curated by ChEMBL
LigandPNGBDBM50257341(CHEMBL4094447)
Affinity DataEC50:  7.40E+3nM. Assay description: Inhibition of human GRK2 expressed in HEK-B2 cells assessed as isoproterenol-stimulated cAMP accumulation preincubation for 20 mins followed by isopr...
In DepthDetails ArticlePubMed
TargetRho-associated protein kinase 2(Homo sapiens (Human))
Takeda Pharmaceutical
Curated by ChEMBL
LigandPNGBDBM50257341(CHEMBL4094447)
Affinity DataIC50:  720nM. Assay description: Inhibition of recombinant human N-terminal GST-tagged ROCK2 catalytic domain (1 to 553 residues) expressed in baculovirus expression system using STK...
In DepthDetails ArticlePubMed
TargetBeta-adrenergic receptor kinase 1(Homo sapiens (Human))
Takeda Pharmaceutical
Curated by ChEMBL
LigandPNGBDBM50257341(CHEMBL4094447)
Affinity DataIC50:  7.80nM. Assay description: Inhibition of recombinant human N-terminal GST-tagged GRK2 expressed in baculovirus expression system using ulight topo2alpha as substrate preincubat...
In DepthDetails ArticlePubMed