BDBM50257445 CHEMBL4095659
SMILES COc1ccccc1CNC(=O)c1cccc(NCc2nnc([nH]2)-c2ccncc2)c1
InChI Key InChIKey=QHMDGFUUSLLYGF-UHFFFAOYSA-N
Data  3 IC50  1 EC50
  Tab Delimited (TSV)   2D SDfile   Computed 3D by Vconf -m prep SDfile
Find this compound or compounds like it in BindingDB:
Activity Spreadsheet -- Enzyme Inhibition Constant Data from BindingDB
Found 4 hits for monomerid = 50257445
TargetBeta-adrenergic receptor kinase 1(Homo sapiens (Human))
Takeda Pharmaceutical
Curated by ChEMBL
LigandPNGBDBM50257445(CHEMBL4095659)
Affinity DataIC50:  3nM. Assay description: Inhibition of recombinant human N-terminal GST-tagged GRK2 expressed in baculovirus expression system using ulight topo2alpha as substrate preincubat...
In DepthDetails ArticlePubMed
TargetBeta-adrenergic receptor kinase 1(Homo sapiens (Human))
Takeda Pharmaceutical
Curated by ChEMBL
LigandPNGBDBM50257445(CHEMBL4095659)
Affinity DataEC50:  7.60E+4nM. Assay description: Inhibition of recombinant human N-terminal GST-tagged GRK2 expressed in baculovirus expression system using ulight topo2alpha as substrate preincubat...
In DepthDetails ArticlePubMed
TargetProtein kinase C alpha type(Homo sapiens (Human))
Takeda Pharmaceutical
Curated by ChEMBL
LigandPNGBDBM50257445(CHEMBL4095659)
Affinity DataIC50:  3.30E+3nM. Assay description: Inhibition of human PKCalpha active using MBP as substrate after 60 mins in presence of [gamma-32]ATP by scintillation counting
In DepthDetails ArticlePubMed
TargetRho-associated protein kinase 2(Homo sapiens (Human))
Takeda Pharmaceutical
Curated by ChEMBL
LigandPNGBDBM50257445(CHEMBL4095659)
Affinity DataIC50:  85nM. Assay description: Inhibition of recombinant human N-terminal GST-tagged ROCK2 catalytic domain (1 to 553 residues) expressed in baculovirus expression system using STK...
In DepthDetails ArticlePubMed