BDBM50257538 CHEMBL493119::Methyl (2S*,3S*,7aS*)-3-(3,4-dimethoxyphenyl)-2-ethenesulfonyl-5-oxotetrahydropyrrolizine-7a-carboxylate
SMILES COC(=O)[C@@]12CCC(=O)N1[C@H]([C@H](C2)S(=O)(=O)C=C)c1ccc(OC)c(OC)c1
InChI Key InChIKey=OTCBVUNCQNLIQS-IEZWGBDMSA-N
Data  1 IC50
  Tab Delimited (TSV)   2D SDfile   Computed 3D by Vconf -m prep SDfile
Find this compound or compounds like it in BindingDB:
Activity Spreadsheet -- Enzyme Inhibition Constant Data from BindingDB
Found 1 hit for monomerid = 50257538
TargetSortase family protein(Staphylococcus aureus)
M.V. Lomonosov Moscow State University
Curated by ChEMBL
LigandPNGBDBM50257538(CHEMBL493119 | Methyl (2S*,3S*,7aS*)-3-(3,4-dimeth...)
Affinity DataIC50:  2.68E+6nM. Assay description: Inhibition of 6-His tagged Staphylococcus aureus recombinant sortase delta N24 expressed in Escherichia coli BL21 (DE3)
In DepthDetails ArticlePubMed