BDBM50257830 CHEMBL493781::N-(1-(4-aminopyridin-2-yl)piperidin-4-yl)-N-(pyridin-2-yl)cyclopropanecarboxamide
SMILES Nc1ccnc(c1)N1CCC(CC1)N(C(=O)C1CC1)c1ccccn1
InChI Key InChIKey=ADEMYEDPMWTMAN-UHFFFAOYSA-N
Data  1 KI  1 EC50
  Tab Delimited (TSV)   2D SDfile   Computed 3D by Vconf -m prep SDfile
Find this compound or compounds like it in BindingDB:
Activity Spreadsheet -- Enzyme Inhibition Constant Data from BindingDB
Found 2 hits for monomerid = 50257830
TargetPotassium voltage-gated channel subfamily H member 2(Homo sapiens (Human))
Pfizer
Curated by ChEMBL
LigandPNGBDBM50257830(CHEMBL493781 | N-(1-(4-aminopyridin-2-yl)piperidin...)
Affinity DataKi: >1.00E+4nM. Assay description: Inhibition of human ERG
In DepthDetails ArticlePubMed
TargetDelta-type opioid receptor(Homo sapiens (Human))
Pfizer
Curated by ChEMBL
LigandPNGBDBM50257830(CHEMBL493781 | N-(1-(4-aminopyridin-2-yl)piperidin...)
Affinity DataEC50:  108nM. Assay description: Agonist activity at delta opioid receptor expressed in CHO cells assessed as inhibition of forskolin-stimulated cAMP production by ALPHAscreen assay
In DepthDetails ArticlePubMed